Base: 2fd28bf938; test-only commit: af47fec5eb Command: vp test run apps/server/src/orchestration-v2/Adapters/CodexAdapterV2.test.ts -t 'never answers|transport dies|initialize' Reported by fresh Claude Opus 5.5 test agent: 3 failed, 3 passed. FAIL > fails thread/start that the shared app-server never answers AssertionError: ensureThread was still waiting on thread/start after 5 minutes: expected false to be true FAIL > fails turn/start that the shared app-server never answers AssertionError: startTurn was still waiting on turn/start after 5 minutes: expected false to be true FAIL > fails the session event stream when the app-server transport dies AssertionError: session events kept waiting after the app-server transport terminated: expected false to be true Tests use real replay transport, Deferred milestones and TestClock.adjust (5 virtual minutes), not wall-clock sleeps.